Root harvesters
alternative label: Beet lifters
alternative label: ماشین‌های چغندرکن @fa
preferred label: دروگرهای گیاهان ریشه‌ای @fa
scope note: دربرگیرنده ریشه‌ها، تکمه‌ها و همه محصولات زیر زمینی. @fa
scope note: Including roots, tubers and all underground fruits
type: Concept
broader: Harvesters
narrower: Root cutters

Harvesters
preferred label: دروگرها (ماشین) @fa
type: Concept
narrower: Root harvesters

Root cutters
preferred label: برش‌دهنده‌های محصولات ریشه‌ای @fa
type: Concept
broader: Root harvesters