Mixed grazing
scope note: The use of cattle and sheep in a common grazing system, whether or not the two species graze on the same area of land at the same time
scope note: چرانیدن گاو و گوسفند در چراگاهی واحد چه با هم باشند یا در زمان‌های متفاوت. @fa
broader: Grazing systems
preferred label: چرای مختلط @fa
type: Concept

Grazing systems
preferred label: نظام‌های چرا @fa
type: Concept
has narrower: Mixed grazing
narrower: Mixed grazing