دارای هدف فعالیت
label: has object of activity @en

شناسه گر
label: identifier @en

نظام‌های کشت‌ومرتع
preferred label: Agrosilvopastoral systems @en
شناسه گر: جنگل زراعی
broader: جنگل زراعی
type: Concept
scope note: Agroforestry systems with woody perennials, food crops, pastures and livestock @en
scope note: سیستم‌های جنگل زراعی همراه با درختان چندساله، محصولات غذایی، چراگاه‌ها و دام.
دارای اصطلاح وابسته: جنگل زراعی
دارای اصطلاح وابسته: گله‌داری
دارای هدف فعالیت: گله‌داری

جنگل زراعی
preferred label: Agroforestry @en
type: Concept
is in semantic relation with: نظام‌های کشت‌ومرتع
دارای اصطلاح وابسته: نظام‌های کشت‌ومرتع
narrower: نظام‌های کشت‌ومرتع

دارای اصطلاح وابسته
label: has related @en

گله‌داری
preferred label: Pastoralism @en
type: Concept
is natural enemy of: نظام‌های کشت‌ومرتع
دارای اصطلاح وابسته: نظام‌های کشت‌ومرتع