دارای مفهوم (واژه) اعم
label: has broader @en

رابطه والد فرزندی
label: parents @en

جذب‌کنندگی
رابطه والد فرزندی: خواص نوری
دارای مفهوم (واژه) اعم: خواص نوری
scope note: Ability of a layer of a substance to absorb radiation @en
scope note: توانایی لایه‌ای از یک ماده برای جذب پرتوها.
broader: خواص نوری
preferred label: Absorbance @en
type: Concept

خواص نوری
preferred label: Optical properties @en
type: Concept
narrower: جذب‌کنندگی