Glyceraldehyde 3 phosphate dehydrog
scope note: Glyceraldehyde 3 phosphate dehydrogenase; IUPAC code 1 2 1 12
scope note: گلیسرآلدئید 3 فسفات دهیدروژناز @fa
broader: Oxidoreductases
preferred label: گلیسرآلدئید 3 فسفات دهیدروژناز @fa
type: Concept

Oxidoreductases
preferred label: اکسیدوردوکتازها @fa
type: Concept
narrower: Glyceraldehyde 3 phosphate dehydrog