Analytical methods
preferred label: روش‌های تجزیه‌ای @fa
type: Concept
has narrower: Quantitative analysis
narrower: Quantitative analysis

Quantitative analysis
alternative label: Quantitative analytical techniques
alternative label: فنون تجزیه کمی @fa
scope note: Determination of the amounts of chemical elements or compounds
broader: Analytical methods
preferred label: تجزیه کمی @fa
type: Concept