Animal husbandry methods
preferred label: روش‌های دامپروری @fa
type: Concept
narrower: Wintering

Wintering
alternative label: Livestock overwintering
alternative label: دامپروری طی زمستان @fa
scope note: Care, feeding and maintenance of livestock through the winter months
scope note: مواظبت، غذادادن و نگهداری دام در ماه‌های زمستان. @fa
broader: Animal husbandry methods
preferred label: دامپروری زمستانه @fa
type: Concept