پیوند جوانه
scope note: پیوند دو گیاه مختلف با قرار دادن جوانه یکی در ساقه دیگری؛ برای پدیده‌های طبیعی به کار برید جوانه‌آغازی
scope note: The union of two different plants by inserting the bud of one into the stem of the other; for the naturally occurring phenomenon use <15948> @en
broader: پیوند‌زنی (گیاهان)
preferred label: Budding @en
type: Concept

پیوند‌زنی (گیاهان)
preferred label: Grafting @en
type: Concept
narrower: پیوند جوانه