Sardines
has related: Sardinops
has related: Sardina
scope note: Isscaap group b-35; note that this term may also be applied in the fish trade to sprats and small herrings
scope note: ایساکاپ گروه b-35، توجه کنید که این اصطلاح ممکن است در تجارت ماهی برای شاه‌ماهیان نیز به کار برده شود. @fa
broader: Saltwater fishes
preferred label: ماهیان ساردین @fa
type: Concept

Sardinops
preferred label: ساردینوپس @fa
type: Concept
has related: Sardines

has related
label: دارای اصطلاح وابسته @fa

Saltwater fishes
preferred label: ماهیان آب شور @fa
type: Concept
narrower: Sardines

Sardina
preferred label: ساردینا @fa
type: Concept
has related: Sardines