Chimaeriformes
preferred label: کیمریفورمس @fa
type: Concept
narrower: Chimaera

Chimaera
scope note: ایساکاپ گروه b-38؛ منحصر به رده ماهی‌ها؛ برای موجودات زنده که از بافت منابع ژنتیکی متفاوتی تشکیل شده‌اند به کار برید شیمراها @fa
scope note: Isscaap group b-38; restricted to the fish genus; for organisms formed from tissues of different genetic origins use <24830>
broader: Chimaeriformes
preferred label: ماهی شیمرا @fa
type: Concept