Structural timber
preferred label: تیر چوبی ساختمانی @fa
type: Concept
has narrower: Sleepers
narrower: Sleepers

Sleepers
alternative label: Railroad ties
alternative label: تیرهای افقی راه‌آهن @fa
scope note: Timber laid horizontally on the ground to support other members or constructions
scope note: الوارهایی که به صورت افقی بر روی زمین قرار داده می‌شوند برای حفاظت از سایر قطعات و ساخت‌ها. @fa
broader: Structural timber
preferred label: تیرهای زیرساخت @fa
type: Concept