Nut products
preferred label: فراورده‌های مغزدار @fa
type: Concept
narrower: Coconut milk

Coconut milk
scope note: عصاره شیری که با فشردن نارگیل به دست آمده؛ برای مایع آبداری که در حفره آن وجود دارد به کار برید آب نارگیل @fa
scope note: Milky extract obtained by pressing; for the aqueous liquid within the cavity of the nut use <34238>
broader: Nut products
preferred label: شیر نارگیل @fa
type: Concept