Byproducts
preferred label: فراورده‌های فرعی @fa
type: Concept
narrower: Sugar byproducts

Sugar byproducts
scope note: Residues or wastes of sugar plants in sugar industry
scope note: پسماندها یا باقیمانده‌های گیاهان قندی در صنعت قندسازی. @fa
broader: Byproducts
preferred label: فراورده‌های فرعی شکر @fa
type: Concept