USSR
preferred label: اتحاد جماهیر سوسیالیست شوروی (یو.اس.اس.آر) @fa
type: Concept
has narrower: Azerbaidzhan SSR
narrower: Azerbaidzhan SSR

Azerbaidzhan SSR
scope note: قسمتی از اتحاد جماهیر شوروی تا سال 1991; برای مدارک مربوط به آن منطقه قبل از تغییر وضعیت ; برای بعد از آن به کار برید آذربایجان (کشور) @fa
scope note: Part of USSR till 1991; to be used for documents dealing with that region before the change of status; later use <9026>
broader: USSR
preferred label: آذربایجان (جمهوری سوسیالیست شوروی) @fa
type: Concept