قرقیزستان (جمهوری سوسیالیست شوروی)
scope note: قسمتی از اتحاد جمتهیر شوروی قبل از سال 1992؛ برای مدارک مربوط به آن منطقه قبلاز تغییر وضعیت؛ برای بعد از آن به کار برید قرقیزستان
scope note: Part of USSR till 1991; to be used for documents dealing with that region before the change of status; later use <33243> @en
broader: اتحاد جماهیر سوسیالیست شوروی (یو.اس.اس.آر)
preferred label: Kirgiz SSR @en
type: Concept

اتحاد جماهیر سوسیالیست شوروی (یو.اس.اس.آر)
preferred label: USSR @en
type: Concept
has narrower: قرقیزستان (جمهوری سوسیالیست شوروی)
narrower: قرقیزستان (جمهوری سوسیالیست شوروی)