USSR
preferred label: اتحاد جماهیر سوسیالیست شوروی (یو.اس.اس.آر) @fa
type: Concept
has narrower: Kazakh SSR
narrower: Kazakh SSR

Kazakh SSR
scope note: قسمتی از اتحاد جماهیر شوروی تا سال 1991؛برای استفاده از مدارک مربوط به آن منطقه قبل از تغییر وضعیت؛ برای بعد از آن به کار برید قزاقستان @fa
scope note: Part of USSR till 1991; to be used for documents dealing with that region before the change of status; later use <11952>
broader: USSR
preferred label: قزاقستان (جمهوری سوسیالیست شوروی) @fa
type: Concept