AGRIS
scope note: International Information System for the Agricultural Sciences and Technology
scope note: نظام بین‌المللی اطلاعات علمی و فنی کشاورزی. @fa
broader: Information systems
preferred label: اگریس (نظام بین‌المللی اطلاعات علمی و فنی کشاورزی) @fa
type: Concept

Information systems
preferred label: نظام‌‌های اطلاع‌رسانی @fa
type: Concept
has narrower: AGRIS
narrower: AGRIS