Plant developmental stages
preferred label: مراحل تکوین گیاهی @fa
type: Concept
narrower: Emergence

Emergence
alternative label: Seedling emergence
alternative label: پیدایی گیاهچه @fa
scope note: Of the first leaves of a plant above the soil
scope note: مربوط به اولین برگ‌های گیاه روی خاک. @fa
broader: Plant developmental stages
preferred label: پیدایی @fa
type: Concept