دارای مفهوم (واژه) اعم
label: has broader @en

رابطه والد فرزندی
label: parents @en

جمهوری فدرال چکسلواکی (سی.اس.اف.آر)
preferred label: CSFR @en
broader: اروپای شرقی
type: Concept
دارای مفهوم (واژه) اعم: اروپای شرقی
scope note: تنها برای مدارکی که قبل از تاریخ 1992/12/31 منتشر شده‌اند؛ برای بعد از آن به کار برید جمهوری چک یا جمهوری اسلواکی
scope note: Only to be used for documents published before 31.12.1992; later use <33095> or <33096> @en
رابطه والد فرزندی: اروپای شرقی
alternative label: چکسلواکی
alternative label: Czechoslovakia @en

اروپای شرقی
preferred label: Eastern Europe @en
type: Concept
has narrower: جمهوری فدرال چکسلواکی (سی.اس.اف.آر)
narrower: جمهوری فدرال چکسلواکی (سی.اس.اف.آر)