استونی
scope note: قسمتی از اتحاد جماهیر شوروی قبل از سال 1992؛ برای مدارک مربوط به آن منطقه قبل از تغییر موقعیت به کار برید استونی(جمهوری سوسیالیست شوروی)
scope note: Part of USSR before 1992; for documents dealing with that region before the change of status use <2672> @en
broader: کشورهای بالتیک
preferred label: Estonia @en
type: Concept

کشورهای بالتیک
preferred label: Baltic states @en
type: Concept
narrower: استونی