Former Yugoslav Republic of Macedonia
scope note: The Former Yugoslav Republic of Macedonia
scope note: جمهوری یوگسلاو مقدونیه. @fa
broader: Balkans
preferred label: جمهوری یوگسلاو مقدونیه @fa
type: Concept

Balkans
preferred label: کشورهای بالکان @fa
type: Concept
narrower: Former Yugoslav Republic of Macedonia