شورای همیاری اقتصادی دوجانبه (کومکون)
alternative label: کومکون
alternative label: Comecon @en
type: Concept
scope note: شورای همیاری اقتصادی دوجانبه.
scope note: Council for Mutual Economic Assistance @en
دارای مفهوم (واژه) اعم: سازمان‌های بین‌المللی
broader: سازمان‌های بین‌المللی
رابطه والد فرزندی: سازمان‌های بین‌المللی
preferred label: CMEA @en

رابطه والد فرزندی
label: parents @en

سازمان‌های بین‌المللی
preferred label: International organizations @en
type: Concept
has narrower: شورای همیاری اقتصادی دوجانبه (کومکون)
narrower: شورای همیاری اقتصادی دوجانبه (کومکون)

دارای مفهوم (واژه) اعم
label: has broader @en