UNCTAD
parents: UN
has broader: UN
scope note: United Nations Conference on Trade and Development
scope note: کنفرانس سازمان ملل در خصوص تجارت و توسعه. @fa
broader: International organizations
preferred label: کنفرانس توسعه و تجارت ملل متحد (اونکتاد) @fa
type: Concept

UN
preferred label: ملل متحد (یو.ان) @fa
type: Concept
has narrower: UNCTAD

parents
label: رابطه والد فرزندی @fa

has broader
label: دارای مفهوم (واژه) اعم @fa

International organizations
preferred label: سازمان‌های بین‌المللی @fa
type: Concept
narrower: UNCTAD