UNCED
scope note: United Nations Conference on Environment and Development
scope note: کنفرانس سازمان ملل در خصوص محیط زیست و توسعه. @fa
broader: International organizations
preferred label: کنفرانس ملل متحد در خصوص محیط زیست و توسعه (اون‌سد) @fa
type: Concept

International organizations
preferred label: سازمان‌های بین‌المللی @fa
type: Concept
narrower: UNCED