Conventional tillage
scope note: Restricted to comparative studies of tillage systems; add geographic location
scope note: منحصر به مطالعات مقایسه‌ای نظام‌های خاک‌ورزی؛ موقعیت جغرافیایی اضافه شود. @fa
broader: Tillage
preferred label: خاک‌ورزی سنتی @fa
type: Concept

Tillage
preferred label: خاک‌ورزی @fa
type: Concept
has narrower: Conventional tillage
narrower: Conventional tillage