Pinching
scope note: Removal of terminal shoots of plants by pinching off with the fingers
scope note: برداشتن نوساقه‌های انتهایی گیاهان با نوک انگشتان. @fa
broader: Pruning
preferred label: جوانه‌برداری @fa
type: Concept

Pruning
preferred label: هرس @fa
type: Concept
has narrower: Pinching
narrower: Pinching