Destruction of animals
alternative label: Euthanasia
alternative label: بهمرگی @fa
scope note: کشتن یا نابودی حیوانات با اهدافی جز خوردن آنها؛ با خونروی (کشتار دام) اشتباه نشود @fa
scope note: Killing or annihilating of animals for purposes other than eating them; not to be confused with <7107>
narrower: Culling
preferred label: انهدام جانوران @fa
type: Concept

Culling
preferred label: حذف‌کردن گله @fa
type: Concept
parents: Destruction of animals
has broader: Destruction of animals
broader: Destruction of animals