خویشاوندی در خط اطراف
type: Concept
broader: خویشاوندی
preferred label: no equal term @en
scope note: آن نوع از خویشاوندی که به سبب داشتن نسب مشترک به وجود می آید

خویشاوندی
type: Concept
narrower: خویشاوندی در خط اطراف
preferred label: relationship @en