سند اصیل
type: Concept
broader: سند
preferred label: principal document @en
related: سند جعلی
scope note: تفاوت سند اصیل و اصلی این است که گاه سند اصلی، اصیل نیست و جعلی است

سند جعلی
type: Concept
preferred label: forged document @en

سند
type: Concept
narrower: سند اصیل
preferred label: document @en