موضوع توافق
scope note: آنچه در خصوص مورد توافق بر آن موافقت می شود
broader: توافق
preferred label: subject of agreement @en
type: Concept

توافق
preferred label: agreement /mutual consent @en
type: Concept
narrower: موضوع توافق