خویشاوندی در خط مستقیم
preferred label: relationship in direct line @en
type: Concept
narrower: خویشاوندی در خط مستقیم صعودی

خویشاوندی در خط مستقیم صعودی
scope note: در خط مستقیم خویشاوندی، خویشاوندی شخص با اجداد و جداتش را خویشاوندی در خط مستقیم صعودی می گویند.
broader: خویشاوندی در خط مستقیم
preferred label: relationship in ascending direct line @en
type: Concept