جامع نسب
scope note: قرابتی را که به اعتبار داشتن نسب مشترک پدید می آید قرابت در خط اطراف (خویشاوندی در خط اطراف می گویند و شخصی که این گونه خویشاوندان از نسل او هستند جامع نسب نامیده می شود
broader: نسب
preferred label: founder of lineage @en
type: Concept

نسب
preferred label: lineage @en
type: Concept
narrower: جامع نسب