انفارکتوس
type: Concept
broader: بافت‌مردگی
preferred label: infarction @en

بافت‌مردگی
type: Concept
alternative label: نکروز
broader: مرگ سلول
narrower: انفارکتوس
preferred label: necrosis @en
scope note: به مرگ یک سلول یا گروهی از سلول‌ها در بین بافت زنده گیاهی یا جانوری اطلاق می‌شود.

مرگ سلول
type: Concept
narrower: بافت‌مردگی
preferred label: cell death @en