کراسینگ اور
type: Concept
alternative label: هم‌گذري
broader: ژنتیک سلولی
preferred label: crossing over @en
scope note: حالتی است که قطعه‌ای از یک کروموزوم با قطعه‌ای مشابه از کروموزوم همتای خود تعویض می‌شود. این عمل در تقسیم میوز اتفاق می‌افتد.

ژنتیک سلولی
type: Concept
narrower: کراسینگ اور
preferred label: cytogenetics @en