ریلاکسین
type: Concept
broader: هورمون‌ جسم زرد
preferred label: relaxin @en
scope note: هورمونی است که از تخمدان به هنگام زایمان ترشح شده و با شل کردن عضلات لوله تناسلی به تسهیل زایمان کمک می‌کند.

هورمون‌ جسم زرد
type: Concept
narrower: ریلاکسین
preferred label: corpus luteum hormone @en