ژنگاه
type: Concept
alternative label: جایگاه ژن
broader: کروموزوم
preferred label: locus @en
scope note: نقاطی روی کروموزوم‌ها که توسط ژن‌های ویژه اشغال می‌شوند.

کروموزوم
type: Concept
narrower: ژنگاه
preferred label: chromosome @en