آندوسپرم
scope note: بخش مغذی موجود در بعضی بذرها که از کیسه جنینی منشا می‌گیرد.
broader: کالبدشناسی بذر
preferred label: endosperm @en
type: Concept

کالبدشناسی بذر
preferred label: seed anatomy @en
type: Concept
narrower: آندوسپرم