برگه (گل‌آذین)
alternative label: برگک
scope note: برگ کوچکی است که از لحاظ شکل و رنگ با برگهای معمولی اختلاف دارد و در زیر گل دیده می‌شود.
broader: گل‌آذین
preferred label: bract @en
type: Concept

گل‌آذین
preferred label: inflorescence @en
type: Concept
narrower: برگه (گل‌آذین)