انفارکتوس
preferred label: infarction @en
type: Concept
broader: بافت‌مردگی

مرگ سلول
preferred label: cell death @en
type: Concept
narrower: بافت‌مردگی

بافت‌مردگی
alternative label: نکروز
scope note: به مرگ یک سلول یا گروهی از سلول‌ها در بین بافت زنده گیاهی یا جانوری اطلاق می‌شود.
narrower: انفارکتوس
broader: مرگ سلول
preferred label: necrosis @en
type: Concept