گیاهان غیر آرایه‌بندی
preferred label: nontaxonomic plants @en
type: Concept
narrower: گیاه سی3

فوتوسنتز سی3
preferred label: C3 photosynthesis @en
type: Concept
related: گیاه سی3

گیاه سی3
alternative label: گیاه سه‌کربنه
scope note: گیاهانی هستند که در آنها اولین محصول دی‌اکسید کربن، ترکیب سه کربنه فسفوگلیسیریک اسید است.
related: فوتوسنتز سی3
broader: گیاهان غیر آرایه‌بندی
preferred label: C3 plant @en
type: Concept