ژنتیک سلولی
preferred label: cytogenetics @en
type: Concept
narrower: شیمری

شیمری
alternative label: كژزادي
scope note: حالتی که دو تخم با هم یکی شده و یک فرد با دو کاریوتیپ مختلف مثل XX/XY به وجود بیاورد.
broader: ژنتیک سلولی
preferred label: chimerism @en
type: Concept