خامه (گیاه)
scope note: قسمت آزاد مادگی است که به کلاله ختم می‌شود. خامه در فاصله میان تخمدان و کلاله قرار دارد.
broader: مادگی
preferred label: style @en
type: Concept

مادگی
preferred label: gynoecium @en
type: Concept
narrower: خامه (گیاه)