هورمون‌ جسم زرد
preferred label: corpus luteum hormone @en
type: Concept
narrower: ریلاکسین

ریلاکسین
scope note: هورمونی است که از تخمدان به هنگام زایمان ترشح شده و با شل کردن عضلات لوله تناسلی به تسهیل زایمان کمک می‌کند.
broader: هورمون‌ جسم زرد
preferred label: relaxin @en
type: Concept