ژنگاه
alternative label: جایگاه ژن
scope note: نقاطی روی کروموزوم‌ها که توسط ژن‌های ویژه اشغال می‌شوند.
broader: کروموزوم
preferred label: locus @en
type: Concept

کروموزوم
preferred label: chromosome @en
type: Concept
narrower: ژنگاه