سوختن كامل هیدروكربن‌ها
type: Concept
broader: سوختن هیدروكربن‌ها
preferred label: complete combustion of hydrocarbons @en
related: متان
scope note: هیدروکربن‌ها دارای کربن و هیدروژن هستند به همین دلیل از سوختن کامل هیدروکربن‌ها، آب و کربن دی‌اکسید و مقدار قابل توجهی انرژی حاصل می‌شود.

سوختن هیدروكربن‌ها
type: Concept
narrower: سوختن كامل هیدروكربن‌ها
preferred label: combustion of hydrocarbons @en

متان
type: Concept
preferred label: methane @en
related: سوختن كامل هیدروكربن‌ها