مرداب‌ها
type: Concept
broader: آلودگی‌های طبیعی
preferred label: marshes @en
scope note: مرداب‌ها گازهای زیان‌آوری در هوا پخش می‌كنند.

آلودگی‌های طبیعی
type: Concept
narrower: مرداب‌ها
preferred label: natural pollutions @en