بهبود خواص مواد
type: Concept
preferred label: property improvement of matter @en
related: پنی‌سیلین

پنی‌سیلین
type: Concept
broader: ترکیبات شیمیایی
preferred label: penicillin @en
related: بهبود خواص مواد
scope note: پنی‌سیلین در طبیعت به وسیله‌‌ی یك كپك، تولید می‌شود. مولكول پنی‌سیلین كه یك پادزی یا آنتی بیوتیك است، توسط شیمیدان‌ها دستكاری و اصلاح شده است و از آن، خانواده‌ای از پنی‌سیلین‌ها با كیفیت بهتر و مؤثرتر، به وجود آمده است.

ترکیبات شیمیایی
type: Concept
narrower: پنی‌سیلین
preferred label: chemical compound @en