آلكان‌های راست زنجیر
type: Concept
broader: آلكان‌ها
preferred label: straight chain alkanes @en
scope note: آلكان‌هایی را كه در آن‌ها هر اتم كربن به یك یا دو اتم كربن دیگر متصل است، راست زنجیر می‌نامند.

آلكان‌ها
type: Concept
narrower: آلكان‌های راست زنجیر
preferred label: alkanes @en