باز به كار بردن
type: Concept
broader: حفاظت از منابع شیمیایی
preferred label: reutilization @en
scope note: استفاده‌ی دوباره یا چند‌باره از مواد یا وسایل.

حفاظت از منابع شیمیایی
type: Concept
narrower: باز به كار بردن
preferred label: chemical resources protection @en