كاهش مصرف
type: Concept
broader: حفاظت از منابع شیمیایی
preferred label: consumption reduction @en
scope note: کم کردن میزان مصرف و جلوگیری از ایجاد زباله.

حفاظت از منابع شیمیایی
type: Concept
narrower: كاهش مصرف
preferred label: chemical resources protection @en